Name,Street Address,City,State,Zip Code,Phone,Website,Rating,Reviews,Merchant Verified,Zagat Score,Lat,Long,Listing URL
Emerald Plumbing, ,Huntington Beach,CA,,+17143184019,http://www.ocemergencyplumbing.com/,5,6,,,33.669079,-117.965903,https://plus.google.com/113498554712605107322/about
Professional Plumbing Inc,9631 Sailfish Drive,Huntington Beach,CA,92646,+17149643519,http://prof-plumb.com/,,1,true,,33.681536,-117.9603,https://plus.google.com/112879205552202533074/about
Berry's Plumbing Inc.,19371 Worchester Lane,Huntington Beach,CA,92646,+18882614111,http://berrysplumbinginc.com/,,1,,,33.680994,-117.986737,https://plus.google.com/115887435571567936293/about
Discount A-1 Plumbing Heating \x26 AC, ,Huntington Beach,CA,,+18668058673,,5,7,,,33.672456,-117.974373,https://plus.google.com/108636577717518320240/about
Orange Coast Plumbing Service - Sewer,8411 Santana Circle,Huntington Beach,CA,92646,+17149225997,http://orangecoastplumbing.info/,,,,,33.699944,-117.981604,https://plus.google.com/104531818636661958810/about
DeVinney Plumbing, ,Huntington Beach,CA,,+17143922266,http://www.devinneyplumbing.com/,,,,,33.669079,-117.965903,https://plus.google.com/114071572458925909234/about
Paredes Plumbing,20091 Harbor Isle Lane,Huntington Beach,CA,92646,+17143785243,,,1,,,33.670858,-117.967791,https://plus.google.com/108285330616699419324/about
Rescue Rooter, ,Huntington Beach,CA,92646,+17149074507,http://www.rescuerooter.com/,,,,,33.658774,-117.965904,https://plus.google.com/104874821467996067732/about
Pyxis Water System Inc,8544 Hamilton Avenue,Huntington Beach,CA,92646,+17143745132,http://pyxiswatersystems.com/,,,,,33.650479,-117.978177,https://plus.google.com/107676883928334906235/about
Geers Plumbing \x26 Heating,222 Adams Avenue,Huntington Beach,CA,92648,+17145361449,http://www.geersplumbing.com/,3.5,5,,,33.671875,-117.995861,https://plus.google.com/112700587296154316319/about
Savannah Heating \x26 Air,21661 Brookhurst Street,Huntington Beach,CA,92646,+17142048686,,,,,,33.647881,-117.955954,https://plus.google.com/118294096584072211977/about
Gardners Plumbing,8101 Constantine Drive,Huntington Beach,CA,92646,+17147947927,,,,,,33.689538,-117.986913,https://plus.google.com/116452257548453101641/about
Bill Sherman Perfection Plumbing,9642 Caithness Drive,Huntington Beach,CA,92646,+17149644586,,,,,,33.664426,-117.959618,https://plus.google.com/118430055179780713039/about
Repair by Max H.B.,20702 Reef Lane,Huntington Beach,CA,92646,+19517518330,,,,,,33.662126,-117.957521,https://plus.google.com/107742399817187937439/about
GOLDEN STATE POOL \x26 SPA LEAK DETECTION \x26 EQUIPMENT REPAIRS, ,Huntington Beach,CA,,+17143626028,http://www.goldenstatehelp.com/,,2,,,33.668604,-117.949666,https://plus.google.com/112346163250849635270/about
Huntington Beach Plumbing \x26 HVAC,8411 Santana Circle,Huntington Beach,CA,92646,+17149225997,http://orangecoastplumbing.info/,,,,,33.699944,-117.981604,https://plus.google.com/102313217466202605178/about
West Coast Restoration,19881 Brookhurst Street,Huntington Beach,CA,92646,+17146257595,http://www.flood-pro.com/,,,,,33.673682,-117.954185,https://plus.google.com/111416099671432409505/about
D T S Plumbing,20711 Sandpiper Lane,Huntington Beach,CA,92646,+17149601818,,,,,,33.66175,-117.981736,https://plus.google.com/117648639611978624948/about
7 11 Plumbing,10392 Shangri La Drive,Huntington Beach,CA,92646,+17143780711,,,,,,33.678347,-117.946557,https://plus.google.com/105480812894340972127/about
Kastle Plumbing King of Slab Leaks,1539 Monrovia Avenue,Newport Beach,CA,92663,+19496451234,http://www.kastleplumbing.com/,,3,,,33.630571,-117.936395,https://plus.google.com/105157208843606284761/about
Proserv Plumbing \x26 Drain, ,Huntington Beach,CA,92646,+17149644421,,,,,,33.658774,-117.965904,https://plus.google.com/103098722793537676855/about
Ei Desmet Plumbing,8381 Doncaster Drive,Huntington Beach,CA,92646,+17145363688,,,,,,33.653245,-117.9814,https://plus.google.com/106528670699438022236/about
Precise Plumbing Contractors,8362 Malloy Drive,Huntington Beach,CA,92646,+17149691090,,,,,,33.66548,-117.981934,https://plus.google.com/114675996107478644200/about
Ron's Fiberglass Services,21851 Newland Street,Huntington Beach,CA,92646,+17605089109,,,,,,33.645688,-117.980132,https://plus.google.com/109995429848968011999/about
Huntington Beach Local Plumber, ,Huntington Beach,CA,,+18883127378,,,,,,33.659223,-117.964279,https://plus.google.com/108306677167916624547/about
Snyder Services, ,Huntington Beach,CA,92646,+19496897249,http://www.handymanhuntingtonbeach.net/#cid\x3dglbc,,,,,33.687097,-117.985665,https://plus.google.com/113735427478603813647/about
P R Plumbing, ,Huntington Beach,CA,92646,+17149691177,,,,,,33.658774,-117.965904,https://plus.google.com/102287622502699131964/about
PCH Plumbing,419 Main St,Huntington Beach,CA,92648,+17143222684,,5,7,,,33.660661,-117.999038,https://plus.google.com/113583265888014274971/about
Clean Plumbing, ,Huntington Beach,CA,,+17144027079,http://www.cleanplumbingoc.com/,5,5,,,33.895213,-118.043978,https://plus.google.com/104812430872074257213/about
Reliable Rooter \x26 Plumbing Inc.,2925 College Avenue,Costa Mesa,CA,92626,+19496735600,http://www.reliablerooter.com/,,1,,,33.677721,-117.916913,https://plus.google.com/110278966305402644485/about
The Home Depot,2300 Harbor Boulevard,Costa Mesa,CA,92626,+19496464220,http://www.homedepot.com/l/Costa-Mesa/CA/Costa-Mesa/92626/6664?cid\x3dsem::glbc,4,5,,,33.656921,-117.91895,https://plus.google.com/103914972041360771782/about
Newport Beach Rapid Plumbing, ,Newport Beach,CA,,+19492039678,http://plumbernewportbeach.org/,,2,,,33.604917,-117.911274,https://plus.google.com/109633446225230795029/about
Rooter Alert Plumbing, ,Costa Mesa,CA,,+19517360345,http://www.rooteralert.com/,,2,,,33.641527,-117.919529,https://plus.google.com/107038397936887370214/about
Empire Plumbing Heating \x26 AC,9200 Candlewood Drive,Huntington Beach,CA,92630,+17149695568,,,,,,33.668997,-117.966017,https://plus.google.com/105301126589909495421/about
Crown Ace Hardware,2666 Harbor Boulevard,Costa Mesa,CA,92626,+17145467080,http://www.acehardware.com/mystore/index.jsp?store\x3d09234\x26amp;cid\x3dlocalstore09234,,1,true,,33.669965,-117.918461,https://plus.google.com/114921482815096189105/about
"Costa ProA-1 Plumbing,Heating, Air Cond", ,Costa Mesa,CA,,+18663466783,,,2,,,33.635614,-117.932815,https://plus.google.com/104954985066623734298/about
Ferguson,1781 Placentia Avenue,Costa Mesa,CA,92627,+19496500646,http://www.ferguson.com/branch/costa-mesa-ca-plumbing,,1,true,,33.639036,-117.932704,https://plus.google.com/102886769393634099604/about
"Brothers Plumbing, Heating and Air Service",1675 Superior Avenue,Costa Mesa,CA,92627,+19495485558,http://www.brothersplumbingheatingandair.com/,,4,,,33.635179,-117.924822,https://plus.google.com/103833944955705399469/about
C \x26 R Drains Inc., ,Costa Mesa,CA,92626,+17146411545,http://www.candrdrains.com/,,,,,33.701278,-117.921074,https://plus.google.com/100502333053553326113/about
Wallace Plumbing, ,Costa Mesa,CA,,+19497434900,http://profile.29prime.com/CA/Costa+Mesa/Plumber/Wallace+Plumbing,5,5,,,33.666722,-117.912608,https://plus.google.com/118018992617774035256/about
Handyman Express,501 Frankfort Avenue,Huntington Beach,CA,92648,+17148785959,http://www.handymanexpress.net/,,,,,33.662312,-117.992592,https://plus.google.com/103910437863595806315/about
"Mr. Speedy Plumbing \x26 Rooter, Inc.",7611 Slater Avenue,Huntington Beach,CA,92647,+17143620024,http://www.mrspeedyplumbing.com/,,3,,,33.708701,-117.996662,https://plus.google.com/104265327577726765452/about
C\x26R Plumbing,123 Melody Lane,Costa Mesa,CA,92627,+19497226401,http://orangecountyplumbing.net/,5,9,,,33.646097,-117.912385,https://plus.google.com/100857749639170478287/about
John Janis Plumbing,1654 Babcock Street,Costa Mesa,CA,92627,+19496427764,http://www.johnjanisplumbing.com/,,,,,33.634347,-117.933882,https://plus.google.com/105704176328545736474/about
DSB Plumbing,274 Brentwood Street,Costa Mesa,CA,92627,+17146120312,http://dsb-plumbing.com/,,4,,,33.654005,-117.894997,https://plus.google.com/100052404642270258550/about
MICHAEL PRATER PLUMBING,210 18th Street,Huntington Beach,CA,92648,+17143635237,http://www.theplumbersguild.com/,,4,,,33.666517,-118.011944,https://plus.google.com/100849903718730373217/about
Bennett's Plumbing,1690 Placentia Avenue,Costa Mesa,CA,92627,+19496318393,http://www.bennettsplumbing.com/,,1,,,33.635589,-117.930754,https://plus.google.com/115505394114032509772/about
"Orange Plumbing \x26 Rooter, Inc.",18291 Mount Baldy Circle,Fountain Valley,CA,92708,+17149680222,http://www.orange-plumbing.com/,,,,,33.698205,-117.937209,https://plus.google.com/103885979137575005674/about
Plumber Huntington Beach, ,Huntington Beach,CA,92647,+17148686059,http://www.orangecounty-plumber.com/sitemap.php,,,,,33.663951,-117.988295,https://plus.google.com/117861730127369770192/about
Coast Plumbing Heating and Air INC,17390 Mount Cliffwood Circle,Fountain Valley,CA,92708,+17142411414,http://www.coastplumbing.com/,4,14,,,33.710655,-117.930174,https://plus.google.com/114715490401749248034/about
"Coastal A1 Plumbing, Heating \x26 A.C.", ,Costa Mesa,CA,,+19494840763,,,2,,,33.636486,-117.926948,https://plus.google.com/102507129901973128650/about
Mr. Rooter Plumbing,18627 Brookhurst Street,Fountain Valley,CA,92708,+16267104047,http://www.mrrooter1.com/,,1,,,33.692437,-117.954453,https://plus.google.com/110690714395816149600/about
SEALE PLUMBING \x26 ROOTER SERVICE,915 Presidio Drive,Costa Mesa,CA,92626,+17149287557,http://www.sealeplumbing.com/,,,,,33.67165,-117.894935,https://plus.google.com/114754478382730132588/about
"BeachA-1 Plumbing, Heating \x26 Air Conditioning",18652 Florida Street,Huntington Beach,CA,92648,+18664060182,,,3,,,33.691664,-117.990558,https://plus.google.com/114725416751355152351/about
Foster \x26 son plumbing, ,Fountian Valley,CA,,+17148471871,http://www.fosterandsonplumbing.com/,,,,,33.496963,-117.665332,https://plus.google.com/115599714175973051647/about
"Tweedy Plumbing \x26 Drains, Inc.",817 West 17th Street,Costa Mesa,CA,92627,+19496452352,http://www.tweedyplumbing.com/,,,,,33.63557,-117.932637,https://plus.google.com/110751013101723559082/about
Seale Plumbing and Rooter Service, ,Newport Beach,CA,,+18666100459,,,1,,,33.618909,-117.928946,https://plus.google.com/112997791866184183094/about
Newport Tankless,1834 Newport Boulevard,Costa Mesa,CA,92627,+19495158500,http://www.newporttankless.com/,,2,,,33.641325,-117.918042,https://plus.google.com/105662824255548666089/about
Creative Design Plumbing,1824 Monrovia Avenue,Costa Mesa,CA,92627,+19496502710,http://www.creativedesignplumbing.com/,,,,,33.64052,-117.936161,https://plus.google.com/108823728562335906643/about
Swell Plumbing Newport, ,Newport Beach,CA,,+19494911419,http://www.newportbeachcaplumbing.com/,,,,,33.62098,-117.870114,https://plus.google.com/102562350286146871315/about
Reliable Rooter \x26 Plumbing,3103 Samoa Place,Costa Mesa,CA,92626,+19496735600,http://reliablerooter.com/,,,,,33.683032,-117.927947,https://plus.google.com/114222741241305107406/about
"Jim Was Here, Inc. Handyman Services", ,Huntington Beach,CA,,+17143624278,http://www.jimwashere714.com/,,2,,,33.678196,-118.012753,https://plus.google.com/110733152695160786269/about
Orange Plumbing Heating \x26 Air Conditioning,417 Ford Road,Costa Mesa,CA,92627,+19492296641,http://www.orangecoastplumbing.net/,,,,,33.646221,-117.916635,https://plus.google.com/102820625208389477086/about
Bill Metzger Plumbing,1012 Delaware Street,Huntington Beach,CA,92648,+17142800787,http://billmetzgerplumbing.com/,,,,,33.666294,-117.992714,https://plus.google.com/100383291788189152949/about
George Brazil Services,1656 Babcock Street,Costa Mesa,CA,92626,+19495486494,http://georgebrazil.net/,,,,,33.634399,-117.933883,https://plus.google.com/111119317239308831353/about
EXPRESSIONS,1916 Placentia Avenue,Costa Mesa,CA,92627,+19495748188,http://www.expresspipe.com/,,,true,,33.64411,-117.931487,https://plus.google.com/112858651980689494086/about
Huntington Beach ASAP Plumbing, ,Huntington Beach,CA,,+17146602695,http://huntingtonbeachplumber.org/,,3,,,33.680982,-117.988588,https://plus.google.com/110165256666949859450/about
Huntington Beach HydroJetting, ,Huntington Beach,CA,,+17144657819,http://www.huntingtonbeachhydrojetting.com/,,,,,33.696592,-117.999795,https://plus.google.com/113201076507893316414/about
Santa Ana Plumber Pros, ,Santa Ana,CA,,+17145102541,http://plumbersantaana.org/,,3,,,33.701275,-117.906861,https://plus.google.com/112932015192490401972/about
Ken's Handyman Express Inc,501 Frankfort Avenue,Huntington Beach,CA,92648,+17148785959,http://handymanexpressoc.com/,2,6,,,33.662351,-117.992571,https://plus.google.com/108137391473535513830/about
Way To Go Plumbing \x26 Construction,602 Main Street,Huntington Beach,CA,92648,+17143746778,,,,,,33.662602,-117.99881,https://plus.google.com/118188384135599189826/about
Dependable Graham Air Conditioning Inc,2952 Century Place,Costa Mesa,CA,92626,+17145461653,http://www.dependablegraham.com/,,,,,33.678477,-117.889024,https://plus.google.com/107268416950729132307/about
Kicks Plumbing,234 Victoria Street,Costa Mesa,CA,92627,+19496461407,http://www.kicksplumbing.com/,,,,,33.653085,-117.909326,https://plus.google.com/100575652257985440988/about
Parzival Plumbing,1002 Nancy Lane,Costa Mesa,CA,92627,+19493551575,http://www.parzivalplumbing.com/,,1,,,33.657648,-117.941146,https://plus.google.com/118218405752836607238/about
Stephens Company,17198 Santa Clara Street,Fountain Valley,CA,92708,+17143755776,http://stephenscompany.net/,,,,,33.712922,-117.973298,https://plus.google.com/101875007984404167370/about
Immediate Plumbing \x26 Rooter, ,Costa Mesa,CA,,+17143970877,http://immediateplumbingandrooter.net/,,,,,33.742912,-117.833876,https://plus.google.com/101652979673545334049/about
Blue Island Plumbing,17150 Newhope Street,Fountian Valley,CA,92708,+17149651565,http://www.blueislandplumbing.com/,,,,,33.713675,-117.927259,https://plus.google.com/108794757338145735020/about
Evans Plumbing,1720 Whittier Avenue,Costa Mesa,CA,92627,+19496461185,,,,,,33.636866,-117.9404,https://plus.google.com/101879630163189203839/about
"Cornerstone Property Services, Inc.",11623 Slater Avenue,Fountain Valley,CA,92708,+17149791702,http://www.cornerstonepropertyservices.net/,3.5,5,,,33.709674,-117.926526,https://plus.google.com/116899736278815649019/about
Michael's Valley Plumbing Inc,359 Hamilton Street,Costa Mesa,CA,92627,+19496467473,,,,,,33.650612,-117.914437,https://plus.google.com/104366821022017739501/about
"Ideal Kitchen, Bath \x26 Flooring",2330 Harbor Boulevard,Costa Mesa,CA,92626,+17148858888,http://www.idealkbf.com/,,,,,33.658142,-117.918884,https://plus.google.com/105646241087027078513/about
Smardan Supply,17273 Mount Herrmann Street,Fountain Valley,CA,92728,+17145456912,http://www.smardan.com/,,1,,,33.712587,-117.933092,https://plus.google.com/110719548325052082681/about
Santa Ana Plumbing \x26 Sink Repair,3337 South Bristol Street,Santa Ana,CA,92707,+17142485325,http://www.plumbingsantaana.com/,,,,,33.701836,-117.885325,https://plus.google.com/108396802149597923082/about
Cole Services, ,Westminster,CA,92683,+17149017480,http://www.cole-services.com/,4,26,,,33.751344,-117.993861,https://plus.google.com/101614803504279342639/about
The Plumbers Guild,210 18th Street,Huntington Beach,CA,92468,+17143635237,http://www.plumbinghuntingtonbeachca.com/#cid\x3dglbc,,,,,33.666517,-118.011944,https://plus.google.com/112503585367267452669/about
Shoreline Plumbing Inc,1786 Monrovia Avenue,Costa Mesa,CA,92627,+19496455898,,,,,,33.639116,-117.936146,https://plus.google.com/107585668786168573073/about
CSMS Maintenance Services,1101 Victoria Street,Costa Mesa,CA,92627,+19496424221,,,,,,33.652173,-117.944613,https://plus.google.com/100719500096613253272/about
We Need A Plumber,735 Farad Street,Costa Mesa,CA,92627,+19495489884,,,,,,33.634181,-117.929332,https://plus.google.com/105810757348359558780/about
Above \x26 Beyond Handyman Services, ,Huntington Beach,CA,,+19496892190,http://www.abhandyman.com/,,1,,,33.763152,-117.932595,https://plus.google.com/111858039025452512041/about
Niagara Plumbing,13101 Brookhurst Street,Garden Grove,CA,92843,+17145341770,http://www.plumbingsupplyorangecounty.com/,,3,,,33.772449,-117.955522,https://plus.google.com/117059921071138527306/about
Coast 2 Coast Plumbing,17140 San Mateo Street,Fountain Valley,CA,92708,+17145805986,http://www.coast2coastplumbing.com/,,,,,33.713571,-117.950139,https://plus.google.com/101023167821030222401/about
Costa Mesa Plumbing, ,Costa Mesa,CA,,+19493428135,http://costamesaplumber.org/,,1,,,33.685068,-117.898448,https://plus.google.com/108629999993964842803/about
Coast View Plumbing, ,Costa Mesa,CA,,+17149574087,http://coastviewplumbing.com/,,,true,,33.683414,-117.907324,https://plus.google.com/112291825669813520059/about
Zapata Plumbing, ,Costa Mesa,CA,,+19495337255,,,1,,,33.649625,-117.919041,https://plus.google.com/112479017254980284317/about
Beach West Plumbing,1835 Whittier Avenue,Costa Mesa,CA,92627,+19497228558,,,,,,33.640649,-117.941532,https://plus.google.com/106253544712837623501/about
Anchors Aweigh Plumbing,222 8th Street,Huntington Beach,CA,92648,+17145049475,,,1,,,33.66092,-118.003564,https://plus.google.com/100390716180589291545/about
Orange County Plumber Costa Mesa,1835 Newport Boulevard,Costa Mesa,CA,92627,+17148686059,http://www.orangecounty-plumber.com/,,,,,33.641469,-117.919665,https://plus.google.com/113491034174220367551/about
Allen Plumbing \x26 Rooter,2242 Miner Street,Costa Mesa,CA,92627,+19492949497,http://allenplumbingandrooter.com/,,,,,33.655847,-117.921664,https://plus.google.com/103976524064846820870/about
Viking Plumbing, PO Box 5601,Huntington Beach,CA,92615,+17145565634,,,,,,33.657803,-117.969314,https://plus.google.com/102362401131435434653/about
Dorman Plumbing,18821 Coolwater Lane,Huntington Beach,CA,92648,+17147211114,,,1,,,33.689108,-117.998342,https://plus.google.com/107716693197798794688/about
Miles Above Roofing Inc,1346 Logan Avenue,Costa Mesa,CA,92626,+17145490618,,,,,,33.678895,-117.913643,https://plus.google.com/115998612492077484701/about
Jack Stephan Plumbing \x26 Heating, ,Costa Mesa,CA,92628,+19496315225,http://www.jackstephan.com/,,,,,33.673206,-117.923315,https://plus.google.com/101842187532193834382/about
866-My-Drain,4952 Warner Avenue,Huntington Beach,CA,92649,+18666937246,http://866-my-drain.com/,,,,,33.714493,-118.042253,https://plus.google.com/102884275792517910710/about
OC Rooter - Orange County Rooter and Plumbing,575 West 19th Street,Costa Mesa,CA,92627,+17144251992,http://www.ocrooter.com/,,,,,33.642911,-117.922288,https://plus.google.com/103849035123500764720/about
Mr Drain Plumbing,670 W 17th St # 18,Costa Mesa,CA,92627,+19492035120,http://mrdrain.com/,,,,,33.636486,-117.926949,https://plus.google.com/118392751649827499829/about
Watertight Plumbing Inc,16462 Gothard Street,Huntington Beach,CA,92647,+17148422961,http://www.watertightplumbing.net/,,,,,33.723437,-118.000038,https://plus.google.com/116050985710436209731/about
Suburban Plumbing,14933 Adams Street,Midway City,CA,92655,+17145800162,http://suburban-plumbing.com/,,,,,33.745395,-117.988541,https://plus.google.com/115239724707312241906/about
Tom Brennan Plumbing,209 9th Street,Huntington Beach,CA,92648,+17146145298,,,,true,,33.661342,-118.004923,https://plus.google.com/103540224152095349753/about
North County Plumbing,629 Terminal Way,Costa Mesa,CA,92627,+19495480230,,,,,,33.637429,-117.924368,https://plus.google.com/105711426049933514622/about
Ace Dura Flo Systems LLC,3122 West Alpine Street,Santa Ana,CA,92704,+19497240323,http://www.aceduraflo.com/,,1,,,33.702252,-117.911446,https://plus.google.com/118410283464103462480/about
"Tustin/Santa Ana Plumbing, Heating \x26 A.C.", ,Santa Ana,CA,,+17147054938,,,4,,,33.758686,-117.91202,https://plus.google.com/116563908834372159963/about
Boothney \x26 Sons Plumbing,943 Joann Street,Costa Mesa,CA,92627,+19496462387,,,,,,33.65723,-117.938314,https://plus.google.com/114240054424099307933/about
Plumber Huntington Beach,300 Pacific Coast Highway,Huntington Beach,CA,92648,+17144184886,http://plumber-huntington-beach.org/,,2,,,33.657293,-118.000836,https://plus.google.com/102424883826493627494/about
All Service Plumbers of Newport Beach,2233 West Balboa Boulevard,Newport Beach,CA,92663,+18884913839,http://www.allserviceplumbers.com/,,1,,,33.610015,-117.928916,https://plus.google.com/105160636778039250804/about
Aaaa Ernie's Plumbing, ,Huntington Beach,CA,92648,+17149694028,,,,,,33.678196,-118.012753,https://plus.google.com/108505995864044252148/about
WaterDamage.com, ,Huntington Beach,CA,92615,+17144769743,http://www.waterdamage.com/,,,,,33.660659,-117.998998,https://plus.google.com/101396855439263744026/about
DC Drains Inc. Plumbing \x26 General Contracting,220 Newport Center Drive,Newport Beach,CA,92660,+19496897021,http://dcdrainsinc.com/,,,,,33.611626,-117.873837,https://plus.google.com/112675834849922089914/about
Pan Pacific Plumbing,17911 Mitchell South,Irvine,CA,92614,+19494749170,http://www.panpacplumbing.com/,,,,,33.693445,-117.86413,https://plus.google.com/110367441858437884022/about
"NewportA-1 Discount Plumbing,Heating \x26 A.C.",2901 West Coast Highway,Newport Beach,CA,92663,+18663510621,,,1,,,33.620775,-117.924874,https://plus.google.com/105996363890251697584/about
Ace Stainless Supply,3103 West Central Avenue,Santa Ana,CA,92704,+18008888769,http://www.acestainless.com/,,,,,33.713096,-117.910777,https://plus.google.com/116626782029971251514/about
Mr. Speedy Plumber,3337 South Bristol Street,Santa Ana,CA,92704,+17143955357,http://www.mrspeedyplumbing.com/location/ca/oc/santa-ana.html,,,,,33.702574,-117.885332,https://plus.google.com/108337509203144201519/about
Handyman Costa Mesa,641 Shalimar Drive,Costa Mes,CA,92627,+19495665553,http://www.handymancostamesa.com/,,1,,,33.638187,-117.925086,https://plus.google.com/110660429226793355779/about
Bend Tek Inc,3421 West Maywood Avenue,Santa Ana,CA,92704,+17142108966,http://www.bendtekinc.com/,,,,,33.717798,-117.915095,https://plus.google.com/114392081126744628259/about
4 Pals Inc,7072 Garfield Avenue,Huntington Beach,CA,92648,+17143751227,,,,,,33.686357,-118.004846,https://plus.google.com/106189225179767365949/about
O.C. Pro Plumbing Heating \x26 A.C., ,Huntington Beach,CA,,+18775289512,,,2,,,33.770258,-117.890823,https://plus.google.com/100420770437215804785/about
"Plumber Newport Beach, Heating Repair, Service",1901 Westcliff Drive,Newport Beach,CA,92660,+18668052936,,,3,,,33.626523,-117.907318,https://plus.google.com/114327366210839267130/about
ACE DuraFlo Pipe Restoration,3122 West Alpine Street,Santa Ana,CA,92704,+17145647600,http://www.restoremypipes.com/,,,,,33.702079,-117.911305,https://plus.google.com/102546855630136169352/about
"Pure Elements, Inc.", ,Newport Beach,CA,,+19496441800,http://www.pureelements.biz/,,1,,,33.61891,-117.928946,https://plus.google.com/102971595844545163026/about
FOUNTAIN VALLEY PLUMBING \x26 DRAIN SERVICES, ,Fountain Valley,CA,92708,+17145392102,,,2,,,33.709185,-117.95367,https://plus.google.com/104484221463808088057/about
Huntington Beach Plumbing Co,17271 Argo Circle,Huntington Beach,CA,92647,+17148414930,,,,,,33.711523,-118.008588,https://plus.google.com/114306273138170595882/about
Russell \x26 Son Plumbing Inc,2122 South Wright Street,Santa Ana,CA,92705,+17145455597,http://www.russellandsonplumbing.net/,,,,,33.718069,-117.847237,https://plus.google.com/107889241201489892057/about
Steve's Plumbing and Remodels,5901 Warner Avenue,Huntington Beach,CA,92649,+17148912999,http://stevesplumbingandremodels.com/,,,,,33.715822,-118.024928,https://plus.google.com/116119898120558240513/about