Name, Street Address,City,State,Zip,Country,Phone,Main Category,Extra Categories,Rating,Reviews,Review URL,Price,Price Text,Hotel Price,Hotel Price Text,Website,Business Verified,Monday Hours,Tuesday Hours,Wednesday Hours,Thursday Hours,Friday Hours,Saturday Hours,Sunday Hours,Timezone,Image URL,Lat,Long,Food Featured,Hotel Featured,Service Options,Highlights,Popular For,Accessibility,Offerings,Dining Options,Amenities,Atmosphere,Crowd,Planning,Payments,Children,Parking,Pets
Southernmost Point Guest House,1327 Duval St,Key West,FL,33040,United States,+1 305-294-0715,Bed & breakfast,Bed & breakfast,4.8,337,https://search.google.com/local/reviews?placeid=ChIJV07sH8O30YgRPOjETGm_kU8&q=hotels+near+key+west+florida&authuser=0&hl=en&gl=AU,,,$510,None,http://www.southernmostpoint.com/,,,,,,,,,America/New_York,https://lh5.googleusercontent.com/p/AF1QipN48DzqwHe5wNB9v-4L7_xcOfy4FMUJuaeAnYL0=w137-h92-k-no,24.5472832,-81.79670229999999,,"Pool, Beach access, Free breakfast, Free Wi-Fi",,,,,,,,,,,,,,
The Perry Hotel & Marina Key West,7001 Shrimp Rd,Naval Air Station Key West,FL,33040,United States,+1 877-496-8712,hotels,"Hotel, Marina, Resort hotel",4.5,1213,https://search.google.com/local/reviews?placeid=ChIJw3hPvXax0YgRT4gIb6W9iNU&q=hotels+near+key+west+florida&authuser=0&hl=en&gl=AU,,,$515,4-star hotel,https://www.perrykeywest.com/?utm_source=google&utm_medium=organic&utm_campaign=GMB,,,,,,,,,America/New_York,https://lh5.googleusercontent.com/p/AF1QipNdi_xjhIqwpCDDlI3plQHeiX_Pk8ODuLS0wEjQ=w137-h92-k-no,24.5653297,-81.7393331,,"Pool, Free Wi-Fi, Air-conditioned, Breakfast",,,,,,,,,LGBTQ+ friendly,,,,,
"Casa Marina Key West, Curio Collection by Hilton",1500 Reynolds St,Key West,FL,33040,United States,+1 305-296-3535,hotels,"Hotel, Resort hotel",3.6,3646,https://search.google.com/local/reviews?placeid=ChIJOffyTNm30YgRJQ5EnobQkVE&q=hotels+near+key+west+florida&authuser=0&hl=en&gl=AU,,,$783,5-star hotel,https://www.hilton.com/en/hotels/eywcmqq-casa-marina-key-west/?SEO_id=GMB-AMER-QQ-EYWCMQQ&y_source=1_MzQyNTQyNjQtNzE1LWxvY2F0aW9uLndlYnNpdGU%3D,,,,,,,,,America/New_York,https://lh5.googleusercontent.com/p/AF1QipPAx1EcRpq4Y0xUoL8SxfkOVbWdX6pdAemXfI0N=w137-h92-k-no,24.547735199999998,-81.7901279,,"Pool, Spa, Beach access, Free Wi-Fi",,,,,,,,,LGBTQ+ friendly,,,,,
The Duval House,815 Duval St,Key West,FL,33040,United States,+1 305-294-1666,Bed & breakfast,"Bed & breakfast, Guest house, Inn",4.6,554,https://search.google.com/local/reviews?placeid=ChIJqZsZhcK20YgRuXSsvxt734M&q=hotels+near+key+west+florida&authuser=0&hl=en&gl=AU,,,$388,3-star hotel,http://www.theduvalhouse.com/,,,,,,,,,America/New_York,https://lh3.googleusercontent.com/gps-proxy/ALd4DhEm3cN_DcjotGYqN26rQ8In-GKqcpnwUx9H3-BxKIhFehRG9ckciLLfCl9P8-iUXtxqWnKAXAApZvq_UKcnrLni354_t9O-T2qwsVMqqdDbU8tfMgf-wsgDxV_2g-FvZ6omnxyoIclv6k3Y_ekl4OaC05bMQ8t93AqLgQVi0wILTnDgC9ZtLCt5=w138-h92-k-no,24.5526382,-81.8001979,,"Pool, Free breakfast, Air-conditioned, Breakfast",,,,,,,,,,,,,,
"The Reach Key West, Curio Collection by Hilton",1435 Simonton St,Key West,FL,33040,United States,+1 305-296-5000,hotels,Hotel,4,823,https://search.google.com/local/reviews?placeid=ChIJxUn7FfG30YgRIE2azecE-n0&q=hotels+near+key+west+florida&authuser=0&hl=en&gl=AU,,,$785,4-star hotel,https://www.hilton.com/en/hotels/eywqqqq-the-reach-key-west/?SEO_id=GMB-AMER-QQ-EYWQQQQ&y_source=1_MTQ4MTM2MDYtNzE1LWxvY2F0aW9uLndlYnNpdGU%3D,,,,,,,,,America/New_York,https://lh5.googleusercontent.com/p/AF1QipPfnlban3BxVvlmNZRC6SfqCmhx9JzY-tHlR0j1=w138-h92-k-no,24.547537,-81.794242,,"Pool, Spa, Beach access, Air-conditioned",,,,,,,,,,,,,,
Beachside Resort & Residences Key West,3841 N Roosevelt Blvd,Key West,FL,33040,United States,+1 305-296-8100,hotels,"Hotel, Wedding venue",4.3,2168,https://search.google.com/local/reviews?placeid=ChIJhXaAp2ix0YgRTt2ezF3LHJQ&q=hotels+near+key+west+florida&authuser=0&hl=en&gl=AU,,,$622,4-star hotel,https://www.beachsidekeywest.com/,,,,,,,,,America/New_York,https://lh3.googleusercontent.com/gps-proxy/ALd4DhF81Uw7iGTfelxf4Vp_11iebHF9YuygYKQaY7QkhA5CaCnGU6DxiJP3by1yDOuRr5tcFA4JH_AzIf5X4E4Mj18mjZxMG60SfYIBzGdCHwYE1eiZWGUCzYfNAI0dH_2Etq_8kc5TCWvFue17JRCGDhylfqio15uylfOdJiT_mknWv5zcKR6bQltZ=w138-h92-k-no,24.5713245,-81.75233039999999,,"Pool, Beach access, Free Wi-Fi, Air-conditioned",,,,,,,,,LGBTQ+ friendly,,,,,
Pegasus International Hotel,501 Southard St,Key West,FL,33040,United States,+1 305-294-9323,hotels,Hotel,3.9,398,https://search.google.com/local/reviews?placeid=ChIJwzonlem20YgRRu_iLILKWMo&q=hotels+near+key+west+florida&authuser=0&hl=en&gl=AU,,,$395,3-star hotel,http://www.pegasuskeywest.com/,,,,,,,,,America/New_York,https://lh3.googleusercontent.com/gps-proxy/ALd4DhFX5Q2JG_ZmMzMFCKKHWsKZ7ckFZH-EJlAmX9zL6lFKDa8YcX_Qc5E5cZ3mFOF-XclC9KSRsBcWYAGql2mFcWURl-CdQT2vf8QqPxmOnm6mjFoFd7iCAXtR2Pz6Nz2dsk5283RsptKWKFCgAUGcKN4PbSq8BtW6u41rgtTgx2JNYPwjtxdAwXH-=w138-h92-k-no,24.5550592,-81.8020112,,"Pool, Free breakfast, Free Wi-Fi, Air-conditioned",,,,,,,,,,,,,,
Fairfield Inn & Suites Key West at The Keys Collection,3852 N Roosevelt Blvd,Key West,FL,33040,United States,+1 305-320-0910,hotels,"Hotel, Meeting planning service, Wedding venue",4.1,1599,https://search.google.com/local/reviews?placeid=ChIJM8fOxGix0YgRMNvo6eHFCws&q=hotels+near+key+west+florida&authuser=0&hl=en&gl=AU,,,$417,3-star hotel,https://www.marriott.com/en-us/hotels/eywfk-fairfield-inn-and-suites-key-west-at-the-keys-collection/overview/?scid=f2ae0541-1279-4f24-b197-a979c79310b0,,,,,,,,,America/New_York,https://lh3.googleusercontent.com/gps-proxy/ALd4DhGIqfFEGx-Sv2tef-1D7b2W_-476LLSHMM297j43cLdSJ3ooiK1PU0uiq-VrJ7VgFob17oMkHKGVEe5q1QSz9rQtr6UqUlgWGvRAJ5oZu502Llc021eA1mOPuWT3P_PNYqEXPjTUnK2Bz4ETrio4l1abLmAvs4m4tEbahVdo3HHtWMW0sjWFUE=w138-h92-k-no,24.569131799999997,-81.7527544,,"Pool, Free breakfast, Free Wi-Fi, Air-conditioned",,,,,,,,,LGBTQ+ friendly,,,,,
Fitch Lodge - Key West Historic Inns,1030 Eaton St,Key West,FL,33040,United States,+1 305-294-9870,hotels,"Hotel, Historical landmark",4.1,646,https://search.google.com/local/reviews?placeid=ChIJ75XwlsC20YgRBSWyss34sas&q=hotels+near+key+west+florida&authuser=0&hl=en&gl=AU,,,$398,3-star hotel,http://fitchlodgekeywest.com/,,,,,,,,,America/New_York,https://lh5.googleusercontent.com/p/AF1QipPjkYCQOKCy9nQANv5GgAYK6xL-Eo562iP9YP9X=w124-h92-k-no,24.5610547,-81.79670229999999,,"Pool, Free Wi-Fi, Air-conditioned, Breakfast",,,,,,,,,LGBTQ+ friendly,,,,,
Southernmost Beach Resort,1319 Duval St,Key West,FL,33040,United States,+1 800-354-4455,hotels,"Resort hotel, Bar, Event venue, Hotel, Restaurant",4.2,3402,https://search.google.com/local/reviews?placeid=ChIJwXACZ9y20YgRG19FH8RuAcA&q=hotels+near+key+west+florida&authuser=0&hl=en&gl=AU,,,,4-star hotel,http://www.southernmostbeachresort.com/,,,,,,,,,America/New_York,https://lh5.googleusercontent.com/p/AF1QipMIu1W4TaaJpAcJfgblI1Jaz67V8qo5uHfa8CLh=w138-h92-k-no,24.5479478,-81.7965858,,"Pool, Spa, Beach access, Free Wi-Fi",,,,,,,,,,,,,,
Simonton Court Hotel Key West,320 Simonton St,Key West,FL,33040,United States,+1 305-294-6386,hotels,Hotel,4.8,384,https://search.google.com/local/reviews?placeid=ChIJ5zTMTuq20YgRfbAmT2kVKZY&q=hotels+near+key+west+florida&authuser=0&hl=en&gl=AU,,,$509,4-star hotel,http://www.simontoncourt.com/,,,,,,,,,America/New_York,https://lh3.googleusercontent.com/gps-proxy/ALd4DhHQQlGLauc6kQF5-8MSvDVgn4OQS2Dvpcopqgeuhw5lqoa6WETFVMdExJD0OVYyBHIipHeztkZYk_snJA-OAsAmGBsW9_B1rRiUt-zWNv1dUu0D8tcWebhDfJ6C9GEOzVtMnU2_Rv2Dzu7fr4FSQedjKG_uK_rVOj4gysTSBHAM9cWQyXsO5yeQNg=w137-h92-k-no,24.5581235,-81.8027853,,"Pool, Free breakfast, Free Wi-Fi, Air-conditioned",,,,,,,,,,,,,,
Colors on White Street,818 White St,Key West,FL,33040,United States,+1 305-296-4275,hotels,"Hotel, Motel, Vacation home rental agency",3.8,65,https://search.google.com/local/reviews?placeid=ChIJ8xoR9ca20YgRQScWDGp4kOA&q=hotels+near+key+west+florida&authuser=0&hl=en&gl=AU,,,$299,None,https://www.keywesthospitalityinns.com/colorsonwhite,,,,,,,,,America/New_York,https://lh3.googleusercontent.com/gps-proxy/ALd4DhF2K_TdLxLDnXj1sBw4zKpc3pA-NPdI0MYsr8-PRvsUl27c4mmcPWhf5uqg2AVlhkAg-mQxDnPqHhMWq4POmb5IUfu_wC4pTNY4QfQraT2qT5c7nCwF8UEwR3JZJbTrQN1coleNwxzopTzvhmHlOcs0F-6zeodPVfpYHbP84zhrgEnjln1mQSv4=w170-h92-k-no,24.5575156,-81.79240759999999,,"Pool, Free Wi-Fi, Free parking, Air-conditioned",,,,,,,,,LGBTQ+ friendly,,,,,
The Southernmost Inn,525 United St,Key West,FL,33040,United States,+1 888-525-0037,hotels,Hotel,3.9,668,https://search.google.com/local/reviews?placeid=ChIJu0Vhv9y20YgRYMAWKeJUf7g&q=hotels+near+key+west+florida&authuser=0&hl=en&gl=AU,,,$516,2-star hotel,http://www.thesouthernmostinn.com/,,,,,,,,,America/New_York,https://lh3.googleusercontent.com/gps-proxy/ALd4DhGVIBystWUnctLeMKpcOqYsSy-vUPO9Av-ZUneSIvTEZxvnB6S1kibUVM2FNnQ4chS_hKg7-Q9cOZYHOYqgBgFtJQDS5OCaVxA7nDhN7qBjTDddnV1kS9kyLu5fy6gBfAeV-MI-ip0C3-BBJ3ClrZAtnE_bh3WAnlbMM5SNXUOXgOzjLCwVRYX4lg=w138-h92-k-no,24.548971899999998,-81.79645099999999,,"Pool, Free breakfast, Free Wi-Fi, Air-conditioned",,,,,,,,,,,,,,
Key West Villas,512 Angela St,Key West,FL,33040,United States,+1 305-296-7893,hotels,"Hotel, Bed & breakfast, Cottage, Guest house, Villa",4.8,168,https://search.google.com/local/reviews?placeid=ChIJW-uh1-m20YgRZBDg2uTMaV0&q=hotels+near+key+west+florida&authuser=0&hl=en&gl=AU,,,$509,3-star hotel,https://keywestvillas.com/?utm_source=google&utm_medium=GMB,,,,,,,,,America/New_York,https://lh5.googleusercontent.com/p/AF1QipOjF7fDk3XaQoXOOC6bWGGlFog_7yc6nOaBFZ8D=w137-h92-k-no,24.554054299999997,-81.8007773,,"Pool, Free breakfast, Free Wi-Fi, Air-conditioned",,,,,,,,,,,,,,
Silver Palms Inn,830 Truman Ave,Key West,FL,33040,United States,+1 305-294-8700,hotels,"Hotel, Indoor lodging, Lodge",4.5,873,https://search.google.com/local/reviews?placeid=ChIJDTBad8S20YgRS-yBbVPTAUg&q=hotels+near+key+west+florida&authuser=0&hl=en&gl=AU,,,$475,3-star hotel,http://www.silverpalmsinn.com/,,,,,,,,,America/New_York,https://lh3.googleusercontent.com/gps-proxy/ALd4DhHbZsQM3Y94SH5i77qoWYFBHyN2sVmPAb5a0P4GpcZFfonbttMSNIKGAmqAlRGlGcR23_eVGKsPeKoZkwiSd237ln7LKWUrrqq5OCkCLK7dpFBGtpUaIh81JpwEnSkVHoECIH1AAS1kvpez1ktZt95qb5HOx3YPGbzE8AwGnAqM0_t-iTcrDKIR=w131-h92-k-no,24.5534817,-81.7945022,,"Pool, Free breakfast, Free Wi-Fi, Free parking",,,,,,,,,,,,,,
Caribbean House,226 Petronia St,Key West,FL,33040,United States,+1 305-296-0999,Bed & breakfast,"Bed & breakfast, Guest house, Inn",4.6,271,https://search.google.com/local/reviews?placeid=ChIJnQ86Y-i20YgRNJfO3c-4jQM&q=hotels+near+key+west+florida&authuser=0&hl=en&gl=AU,,,$429,None,http://caribbeanhousekw.com/,,,,,,,,,America/New_York,https://lh3.googleusercontent.com/gps-proxy/ALd4DhEnYRKf3Q1MC5P7Hhe9p-WssrnKZK08KZ6JCvB3b0cJm1UgQnuMAIxSYg4Rzpl6lTtzcW3GDSJj7imnfMvGnIsCrE0_tKMkuss0yvmvGKD9UNt4xuV-5Yp2j6pjhsQ4W1avAoomFA0P6jmbovPLb_iMMuqkufeFsAJZTi2NADg7RDCvaPZpOGR7=w111-h92-k-no,24.55127,-81.803,,"Free breakfast, Free Wi-Fi, Air-conditioned, Breakfast",,,,,,,,,LGBTQ+ friendly,,,,,
Tropical Inn,812 Duval St,Key West,FL,33040,United States,+1 305-294-9977,Bed & breakfast,Bed & breakfast,4.8,236,https://search.google.com/local/reviews?placeid=ChIJ3aKcncK20YgRHdfQceZdyGQ&q=hotels+near+key+west+florida&authuser=0&hl=en&gl=AU,,,$414,3-star hotel,https://www.tropicalinn.com/?utm_source=google&utm_medium=GMB,,,,,,,,,America/New_York,https://lh5.googleusercontent.com/p/AF1QipPvmS_iXnL_D30f938r23ap_s-YEeK2PRcgOL6l=w136-h92-k-no,24.5524362,-81.8004704,,"Pool, Free breakfast, Free Wi-Fi, Air-conditioned",,,,,,,,,,,,,,
Pier House Resort & Spa,1 Duval St,Key West,FL,33040,United States,+1 305-296-4600,hotels,"Hotel, Event venue, Resort hotel",4.4,1610,https://search.google.com/local/reviews?placeid=ChIJxXOwQ-u20YgRlFGzCBMnUHo&q=hotels+near+key+west+florida&authuser=0&hl=en&gl=AU,,,$977,4-star hotel,https://www.pierhouse.com/?utm_source=google&utm_medium=organic&utm_campaign=gbp_listing,,,,,,,,,America/New_York,https://lh3.googleusercontent.com/gps-proxy/ALd4DhE59dUXh_veOockF7mFVz8pleO31ve2Ld6VzvpYpeMHNvxQhG2JzRugnvip_LdLAxgL6no0FYRywrLIeonnGjJof8QdLYbQnS_2GEX_If0HQ8BI6s8h1UTv6VFhYO9WUdpiW3c6kRXYppn3UFtBzoSlqFnxIn0ROQxIV4RN2MH1OIgPBd_mfI7Ujw=w136-h92-k-no,24.561206199999997,-81.8058681,,"Pool, Spa, Beach access, Free Wi-Fi",,,,,,,,,,,,,,
The Marker Key West,200 William St,Key West,FL,33040,United States,+1 855-485-9291,hotels,Hotel,4.1,828,https://search.google.com/local/reviews?placeid=ChIJ8cMFveq20YgRtD0jB2Pejmk&q=hotels+near+key+west+florida&authuser=0&hl=en&gl=AU,,,$793,4-star hotel,http://themarkerkeywest.com/?NCK=gl-marker,,,,,,,,,America/New_York,https://lh3.googleusercontent.com/gps-proxy/ALd4DhFOgtmRgI-TAqIhY2uWb8HjWj7T1Bexf3Lc5p8FuzJT_dF6e9tBskGStx-OZk5-eHtO2t8tCd_FSxXJ2ynR6ogYxbvsFVLRwSzD6GEe-pnfcTYWQT14NbZMNy8oQhmpGQrk2ABfk6HWBUq8hSjy3BbTqDc1g-XrFCzEtKlE2WJJPACnOCs-gbHfoA=w138-h92-k-no,24.560453,-81.8017596,,"Pool, Free Wi-Fi, Air-conditioned, Wi-Fi",,,,,,,,,,,,,,
The Conch House,625 Truman Ave,Key West,FL,33040,United States,+1 305-293-0020,Bed & breakfast,"Bed & breakfast, Lodge",4.8,121,https://search.google.com/local/reviews?placeid=ChIJk2GqOMDJ0YgRlN-xMirLFmo&q=hotels+near+key+west+florida&authuser=0&hl=en&gl=AU,,,$525,None,http://conchhouse.com/,,,,,,,,,America/New_York,https://lh3.googleusercontent.com/gps-proxy/ALd4DhFb2o18YVxG0wcgdpCfjuC4weSsEXyf5QEoNF_4dvP1LhUFP4pLnz8HoS3xosShV1yfvrFRiWzQc8WKXVS3t4pXcWDVsnfs0w5Jc38gOiztHoK9apQufO3XaUdHgKV-LyHm9-iAgTjIQh0x-DfnPbajS1fDTNO6EwuS3ABjtU3IeNZ1QlN4IXI=w163-h92-k-no,24.552628,-81.797203,,"Pool, Free breakfast, Free Wi-Fi, Air-conditioned",,,,,,,,,,,,,,
Parrot Key Hotel & Villas,2801 N Roosevelt Blvd,Key West,FL,33040,United States,+1 888-665-6368,hotels,"Hotel, Resort hotel",4.3,1900,https://search.google.com/local/reviews?placeid=ChIJ2yheD0yx0YgRc5WVf6hDhSc&q=hotels+near+key+west+florida&authuser=0&hl=en&gl=AU,,,$700,4-star hotel,https://www.parrotkeyhotel.com/,,,,,,,,,America/New_York,https://lh3.googleusercontent.com/gps-proxy/ALd4DhGZ8khWgSZUH57aljhppI9_xNUn8VHiBJps1-_LLI-nfZgG51OGcjchWt_WJygSf8VcM-Ow73peqZ-lOlmho1w4NY5GZOhLa1nAccUCmtB15IdaYj4UNQM6ZvFf4hBr7RTYFL_2F1prgcS4yZqq3ee_rRw6AtLpy5-gfXkaiMo2f4ZeBgYkb2cLHw=w138-h92-k-no,24.5661863,-81.7733173,,"Pool, Beach access, Free Wi-Fi, Air-conditioned",,,,,,,,,,,,,,
The Laureate Key West,3444 N Roosevelt Blvd,Key West,FL,33040,United States,+1 305-295-7509,hotels,"Resort hotel, Hotel, Serviced accommodation",4.3,972,https://search.google.com/local/reviews?placeid=ChIJjUdVLEOx0YgRx9JvGqxIwe4&q=hotels+near+key+west+florida&authuser=0&hl=en&gl=AU,,,,2-star hotel,https://www.opalcollection.com/laureate/?utm_source=google&utm_medium=listing&utm_campaign=opal+the+laureate,,,,,,,,,America/New_York,https://lh5.googleusercontent.com/p/AF1QipOb1Nb6lLVxAjtWdkHc91fqjV3pd_DHT6rbtfaR=w129-h92-k-no,24.5715096,-81.7601407,,"Pool, Beach access, Free Wi-Fi, Free parking",,,,,,,,,,,,,,
Island City House Hotel,411 William St,Key West,FL,33040,United States,+1 305-294-5702,hotels,"Hotel, Guest house",4.6,275,https://search.google.com/local/reviews?placeid=ChIJZWelzsG20YgRDI7DSCpn4D4&q=hotels+near+key+west+florida&authuser=0&hl=en&gl=AU,,,$501,3-star hotel,http://www.islandcityhouse.com/,,,,,,,,,America/New_York,https://lh3.googleusercontent.com/gps-proxy/ALd4DhF8MRqC68Dqk9Nx7HTjtZObRfRnNGeEar-fQLfovhM7kpJIAF79Oeq0coVmt0jqZpYk5J1ez034RIEQ2_NEuqEeAb9DMB_U88OjhOFOmnrJhXNr8rb7XkKXrjlp2G9JshnO5TegbmW9xpKsB3Vq0-iHiEvIeai7KJ4DWAgor_LOIhcOhgoUWagCJg=w138-h92-k-no,24.5589007,-81.79948329999999,,"Pool, Free Wi-Fi, Free parking, Air-conditioned",,,,,,,,,LGBTQ+ friendly,,,,,
The Garden House,329 Elizabeth St,Key West,FL,33040,United States,+1 305-296-5368,Bed & breakfast,"Bed & breakfast, Hotel, Inn",4.5,300,https://search.google.com/local/reviews?placeid=ChIJ3xAxe-q20YgRS-7DRu_eF6k&q=hotels+near+key+west+florida&authuser=0&hl=en&gl=AU,,,$422,3-star hotel,https://www.the-garden-house.com/,,,,,,,,,America/New_York,https://lh5.googleusercontent.com/p/AF1QipNcldoaAkvjFdAG9KZO_NsEspo6xDnRUkK_vSdb=w80-h100-k-no,24.558837999999998,-81.8012387,,"Pool, Free breakfast, Free Wi-Fi, Air-conditioned",,,,,,,,,,,,,,
The Mansion On The Sea,1400 Duval St,Key West,FL,33040,United States,+1 305-296-3141,hotels,"Hotel, Bar, Bed & breakfast, Swimming pool, Wedding service",4.6,509,https://search.google.com/local/reviews?placeid=ChIJr4NpZ9y20YgRzdVb48gqMPs&q=hotels+near+key+west+florida&authuser=0&hl=en&gl=AU,,,$896,3-star hotel,http://www.themansiononthesea.com/,,,,,,,,,America/New_York,https://lh5.googleusercontent.com/p/AF1QipPJahipFSFXPwiw5iQR5fpur93sNJZ2URcQs_Cp=w138-h92-k-no,24.5469664,-81.7964679,,"Pool, Beach access, Free breakfast, Free Wi-Fi",,,,,,,,,LGBTQ+ friendly,,,,,
Hyatt Vacation Club At Sunset Harbor,200 Sunset Ln,Key West,FL,33040,United States,+1 305-292-2001,hotels,"Resort hotel, Extended stay hotel, Hotel",4.5,366,https://search.google.com/local/reviews?placeid=ChIJ_4CNcuy20YgRhsOBMrTar7g&q=hotels+near+key+west+florida&authuser=0&hl=en&gl=AU,,,,3-star hotel,https://www.hyatt.com/en-US/hotel/florida/hyatt-vacation-club-at-sunset-harbor/kwesh/?src=corp_lclb_gmb_seo_kwesh,,,,,,,,,America/New_York,https://lh5.googleusercontent.com/p/AF1QipORNvyZnWzobFAwR_d8tQIrcYFYgfoWyCDDCsYF=w163-h92-k-no,24.556947899999997,-81.807276,,"Pool, Free Wi-Fi, Air-conditioned, Breakfast",,,,,,,,,,,,,,
Duval Street Suites,824 Duval St,Key West,FL,33040,United States,+1 305-240-2470,hotels,Hotel,4.8,111,https://search.google.com/local/reviews?placeid=ChIJPUTQn8K20YgRUV9LbKMyKVs&q=hotels+near+key+west+florida&authuser=0&hl=en&gl=AU,,,$552,4-star hotel,http://duvalstsuites.com/,,,,,,,,,America/New_York,https://lh5.googleusercontent.com/p/AF1QipOuqSNXBDZfASb5iNC58fXmbp64iIJpFVKjrLHL=w122-h92-k-no,24.5521684,-81.80031389999999,,"Pool, Free Wi-Fi, Free parking, Air-conditioned",,,,,,,,,,,,,,
"Hyatt Vacation Club At Beach House, Key West",5051 Overseas Hwy,Key West,FL,33040,United States,+1 305-294-0059,hotels,"Resort hotel, Extended stay hotel, Hotel",4.5,798,https://search.google.com/local/reviews?placeid=ChIJ8RohW2-x0YgRJIsLlU-eyro&q=hotels+near+key+west+florida&authuser=0&hl=en&gl=AU,,,,4-star hotel,https://www.hyatt.com/en-US/hotel/florida/hyatt-vacation-club-at-beach-house-key-west/keysh/?src=corp_lclb_gmb_seo_keysh,,,,,,,,,America/New_York,https://lh3.googleusercontent.com/gps-proxy/ALd4DhFRg5l1dY-_AaoEQcxbbdxXgJZ7o7vBUHCgCQlB2Qq2TCWRPPHGLtK_QZiAZuwurJUBo162komDPZwSJTIPQoPkr5Y4X1qBw1iuOf9O0EGuQRAHdF3wy1m_HciT7KNQDVPYwk7mPz5lveN79D6T6uNH5-wcDp9Al5dTIW6w8Q2uefXPCafttTG11Q=w138-h92-k-no,24.571416799999998,-81.750946,,"Pool, Beach access, Free Wi-Fi, Free parking",,,,,,,,,,,,,,
Galleria Guesthouse,1016 Howe St,Key West,FL,33040,United States,,Lodging,Accommodation,3.7,85,https://search.google.com/local/reviews?placeid=ChIJbaiPk-e20YgRSCI4akQLYsM&q=hotels+near+key+west+florida&authuser=0&hl=en&gl=AU,,,$366,None,,No,,,,,,,,America/New_York,https://lh3.googleusercontent.com/gps-proxy/ALd4DhGMjoOa08JGAuJtJ42ggDKG-N2soDbfFAyWcH7FvMB-kIN2v_ez8zmgKxNHGRL1jwJBkoELggGH9rIIbWK9sW4R_ONnN__lDSS9ykfgH5z72S7LuzRGQAaTlh3E8yOyCv9RWTvHuKOu81jKrvAhsTdVaw-fLlTpoHopwaWcOAD5PIkp6nVbIMS4Nw=w138-h92-k-no,24.548745,-81.8015544,,"Pool, Free parking, Air-conditioned, Wi-Fi",,,,,,,,,,,,,,
New Orleans House,724 Duval St # 2,Key West,FL,33040,United States,+1 305-293-9800,Guest house,Guest house,4.3,202,https://search.google.com/local/reviews?placeid=ChIJeyS6LOi20YgRFPjpjK1Mmy8&q=hotels+near+key+west+florida&authuser=0&hl=en&gl=AU,,,$373,2-star hotel,,,,,,,,,,America/New_York,https://lh3.googleusercontent.com/gps-proxy/ALd4DhHbjQIc066VHwOJkeAGCtmA0iYgUnh2DC0PygyHSywAySDepZJl_V2YyHYKn9qo9G0ruximzItir62AGKjqvjQ6N8VgHK9-_s9zoBGlsQ5_eXRZ_Gaxv_XM2DHuOfFeeSQLju_Eb_imaSh7fYkhGzkjqmHaRJ3b62u8xDoE5FFfrdDvmjwa7hWi=w122-h92-k-no,24.5529826,-81.800922,,"Pool, Free breakfast, Free Wi-Fi, Air-conditioned",,,,,,,,,,,,,,
Winslow's Bungalows - Key West Historic Inns,725 Truman Ave,Key West,FL,33040,United States,+1 305-294-5229,hotels,"Hotel, Historical landmark",4.2,779,https://search.google.com/local/reviews?placeid=ChIJ26-Sn8O20YgR7eLBxSVjfjY&q=hotels+near+key+west+florida&authuser=0&hl=en&gl=AU,,,$601,4-star hotel,https://www.keywesthistoricinns.com/the-inns/winslows-bungalows/,,,,,,,,,America/New_York,https://lh5.googleusercontent.com/p/AF1QipOecQbPsk_avaGorWLVQcc0dkrwuvGjkBUiTw_N=w138-h92-k-no,24.5533136,-81.7961873,,"Pool, Free breakfast, Free Wi-Fi, Free parking",,,,,,,,,,,,,,
Andrews Inn & Garden Cottages,223 Eanes Ln,Key West,FL,33040,United States,+1 305-294-7730,hotels,"Hotel, Bed & breakfast, Guest house, Inn",4.9,138,https://search.google.com/local/reviews?placeid=ChIJf1p7r8K20YgRdoHqy3OFHDg&q=hotels+near+key+west+florida&authuser=0&hl=en&gl=AU,,,$424,3-star hotel,http://www.andrewsinn.com/,,,,,,,,,America/New_York,https://lh5.googleusercontent.com/p/AF1QipONjoxW5v9HqvD8rji1LZqke5B9QAiVo83wJNYp=w137-h92-k-no,24.5512309,-81.80012049999999,,"Pool, Free breakfast, Free Wi-Fi, Air-conditioned",,,,,,,,,,,,,,
Curry House in Key West by Vacasa,806 Fleming St,Key West,FL,33040,United States,+1 855-861-5757,Bed & breakfast,"Bed & breakfast, Property management company, Vacation home rental agency",4.2,87,https://search.google.com/local/reviews?placeid=ChIJz7ENucG20YgRhMvWTrIE4uU&q=hotels+near+key+west+florida&authuser=0&hl=en&gl=AU,,,$537,3-star hotel,https://www.vacasa.com/usa/Curry-House-Bed-and-Breakfast/?utm_source=gmb&utm_medium=organic&utm_campaign=GMB-Curry-House,No,,,,,,,,America/New_York,https://lh3.googleusercontent.com/gps-proxy/ALd4DhEVEiUifZlN7tLr_Fw79fd3N7HGs4q4as1QWiR9aqRqR6N5p874lP3hrjPLBHY2B3c2a6zpQRTRufUckVCm6RMeV5TQMbIO7yaEW7br-qPOE1xMBhZE3iexTBuvqeOrFehqVtoJRP7vof3Na8wd3kEzAZlSmN40AdUArpXAF4VWQh4wkglkS7wr=w135-h92-k-no,24.558241199999998,-81.7989949,,"Pool, Free breakfast, Free Wi-Fi, Air-conditioned",,,,,,,,,,,,,,
Sunset Key Cottages,245 Front St,Key West,FL,33040,United States,+1 305-292-5300,hotels,"Resort hotel, Cottage rental, Event venue, Hotel, Spa",4.6,807,https://search.google.com/local/reviews?placeid=ChIJS64vE-y20YgRYLMlAvBo-BM&q=hotels+near+key+west+florida&authuser=0&hl=en&gl=AU,,,,4-star hotel,https://www.opalcollection.com/sunset-key-cottages/?utm_source=google&utm_medium=listing&utm_campaign=opal+sunset+key+cottages,,,,,,,,,America/New_York,https://lh5.googleusercontent.com/p/AF1QipMVjx4BD_9zGVrc1mdwwjnUObgtCAdT2XGfJgGf=w151-h92-k-no,24.563089299999998,-81.8142776,,"Pool, Spa, Beach access, Free breakfast",,,,,,,,,,,,,,
An Island Oasis,630 South St,Key West,FL,33040,United States,+1 305-296-4275,Inn,"Inn, Guest house, Hotel",3.7,74,https://search.google.com/local/reviews?placeid=ChIJW_lBvsK20YgR4NkoxMOzuik&q=hotels+near+key+west+florida&authuser=0&hl=en&gl=AU,,,$326,2-star hotel,https://www.keywesthospitalityinns.com/anislandoasis,,,,,,,,,America/New_York,https://lh3.googleusercontent.com/gps-proxy/ALd4DhFa2F8jF1viyPAOfgNp_Z2sz7ZzFfIomVHL8IdqADkAFJ6IWa1_N_mDRrIoG5bX3idzLd03c757U0yQ-1IdluMWnl797E9-mvzh8KkeclzHsF1GuDy-6XKUEKaRgbhJziPdmtLm7BdQyByTO3jFGuHi_STtvBW9Z27DyC_Sit2RzRr7ZHRAcATJ=w138-h92-k-no,24.548495,-81.794112,,"Pool, Free Wi-Fi, Free parking, Air-conditioned",,,,,,,,,LGBTQ+ friendly,,,,,
The Palms Hotel,820 White St,Key West,FL,33040,United States,+1 305-294-3146,hotels,"Hotel, Guest house, Inn",4.1,599,https://search.google.com/local/reviews?placeid=ChIJC8HFisa20YgRda0CJt6Bn6U&q=hotels+near+key+west+florida&authuser=0&hl=en&gl=AU,,,$471,3-star hotel,http://www.palmskw.com/,No,,,,,,,,America/New_York,https://lh3.googleusercontent.com/gps-proxy/ALd4DhHNHlgBPjTJN2qxL3IH2ZTaFo-Etd9csvMlY3JriBfYetcB-jbZsBbXU3m94yLAQ4J5t7DHx_Lmwc2dTm8dBChiQYmR5RS9Lgw9G1OZaKsZAMc9roUdZCkcyAbO3shAqkwOc0oSg_pwJnot_1GqhY2eC0KO7LvjBR0e3FKU_LV1J1fWaDfgeh8=w138-h92-k-no,24.557314599999998,-81.7922447,,"Pool, Free breakfast, Free Wi-Fi, Air-conditioned",,,,,,,,,,,,,,